{"text_format":"1","workbook":"xlsx","n_sheets":9,"sheets":["Instructions","Parcours","Joueurs","Poules","Tournoi","Feuille de match","Joueur 1","Joueur 2","Indiv"],"not_rendered":{"charts":0,"images":2,"macros":1,"external_links":0,"defined_names":55,"comments":2,"pivot_tables":0},"unopened":[],"bounds":{"document_bytes":16777216,"sheet_cells":100000,"rows_first":2000,"rows_last":500,"rows_between":2000,"halvings":0,"cell_chars":16384,"cell_head_chars":4096},"cells_cut":0,"cells_raw":0,"read":"whole","date_system":"1900"}

{"sheet":"Instructions","index":0,"n_rows":50,"n_cols":7,"rows_kept":50,"cut":false,"hidden":true,"merged":[]}
[" "]
[null,"Bienvenue sur le Challenge 35",null,null,"Cuvée :",2018]
[null,null,"Les joueurs participant à ce Challenge sont listés dans l'onglet Joueurs."]
[null,null,"Ils sont listés par ordre d'index, et alphabétique en cas d'index égal."]
[null,null,"Cet ordre détermine la répartion initiale dans les 4 poules automatiquement."]
[]
[null,"1ère manche : poules"]
[null,null,"La liste des rencontres est dans l'onglet Poules."]
[null,null,"Pour chaque rencontre est indiqué le nombre de coups reçus par le jour d'index le plus faible, pour 9 et 18 trous."]
[null,null,"Pour un 18 trous, il est égal à 75% de la différence d'index, arrondi à la valeur entière la plus proche, avec un maximum de 27."]
{"$rows_left_out":41}
{"sheet":"Parcours","index":1,"n_rows":94,"n_cols":48,"rows_kept":94,"cut":false,"hidden":true,"merged":[]}
["Parcours","Trous","PAR",1,{"$f":"D1+1","v":2},3,4,5,6,7,8,9,{"$f":"L1+1","v":10},{"$f":"M1+1","v":11},12,13,14,15,16,17,18,"Handicap",1,{"$f":"W1+1","v":2},{"$f":"X1+1","v":3},{"$f":"Y1+1","v":4},{"$f":"Z1+1","v":5},{"$f":"AA1+1","v":6},{"$f":"AB1+1","v":7},{"$f":"AC1+1","v":8},{"$f":"AD1+1","v":9},{"$f":"AE1+1","v":10},{"$f":"AF1+1","v":11},{"$f":"AG1+1","v":12},{"$f":"AH1+1","v":13},{"$f":"AI1+1","v":14},{"$f":"AJ1+1","v":15},{"$f":"AK1+1","v":16},{"$f":"AL1+1","v":17},{"$f":"AM1+1","v":18},"Slope blanc","SSS blanc","Slope jaune","SSS jaune","Slope bleu","SSS bleu","Slope rouge","SSS rouge"]
["Ableiges - Les étangs",18,"PAR",4,4,5,3,4,5,4,3,4,5,4,3,4,4,5,4,3,4,"Handicap",4,6,12,8,2,10,16,18,14,13,3,11,5,7,15,1,17,9,139,73.599999999999994,132,71.3,134,74.099999999999994,129,71.400000000000006]
["Apremont",18,"PAR",4,5,3,5,4,4,4,3,4,5,4,3,4,5,4,3,4,4,"Handicap",5,9,15,1,7,17,3,13,11,10,2,16,6,12,4,14,18,8,134,73.099999999999994,124,70,122,73.400000000000006,120,71.3]
["Bellefontaine - Rouge",9,"PAR",4,4,5,3,4,3,4,4,5,null,null,null,null,null,null,null,null,null,"Handicap",8,5,6,9,4,3,2,1,7,null,null,null,null,null,null,null,null,null,64,35.4,63,34.4,64,36.299999999999997,58,34.9]
["Bellefontaine - Jaune Blanc",18,"PAR",4,4,5,4,3,4,3,5,4,4,4,4,3,4,5,3,4,5,"Handicap",17,1,7,3,9,11,15,13,5,18,14,8,6,2,16,10,4,12,128,72.900000000000006,125,70.2,125,72.900000000000006,123,69.8]
["Bellefontaine - Jaune Rouge",18,"PAR",4,4,5,4,3,4,3,5,4,4,4,5,3,4,3,4,4,5,"Handicap",17,1,7,3,9,11,15,13,5,16,10,12,18,8,6,4,2,14,127,72.2,125,70,126,73,120,70]
["Bellême",18,"PAR",5,4,3,4,5,3,4,4,5,4,4,5,4,3,4,3,4,4,"Handicap",14,18,4,2,16,6,8,12,10,1,3,17,9,7,15,5,11,13,135,72.5,127,70.5,125,72.400000000000006,121,70.099999999999994]
["Béthemont",18,"PAR",4,3,4,4,3,5,3,5,5,4,5,4,3,5,4,4,3,4,"Handicap",7,13,1,3,15,9,17,11,5,14,8,6,12,16,2,10,18,4,134,73.099999999999994,122,71.2,131,74.8,126,72.5]
["Boucles de Seine",18,"PAR",4,4,4,3,5,4,3,4,4,4,4,4,4,4,3,4,3,5,"Handicap",6,7,3,15,1,5,18,9,4,8,13,11,12,10,16,14,17,2,129,69.099999999999994,124,67.099999999999994,124,68,120,67.099999999999994]
["Buc",9,"PAR",3,3,3,4,3,3,3,3,3,null,null,null,null,null,null,null,null,null,"Handicap",4,6,3,1,7,5,9,8,2,null,null,null,null,null,null,null,null,null,45,26.1,45,26.1,45,26.2,45,26.2]
{"$rows_left_out":85}
{"sheet":"Joueurs","index":2,"n_rows":24,"n_cols":9,"rows_kept":24,"cut":false,"hidden":true,"merged":[]}
["ASIP Golf",null,"Challenge 35 : les joueurs"]
[]
["Numéro","Poule","Nom","Prénom","S","Index","Licence","Index Orig","Repère"]
[1,"A","MABILE","Claude","H",17.399999999999999,546853076,16.899999999999999,{"$f":"IF(E4=\"H\",IF(F4<=15,\"Blanc\",\"Jaune\"),IF(F4<18.4,\"Bleu\",\"Rouge\"))","v":"Jaune"}]
[2,"D","SZAFIR","Patrick","H",{"$f":"H5","v":20.100000000000001},528029072,20.100000000000001,"Jaune"]
[3,"C","COULOMB","Thierry","H",20.2,542760227,20.2,"Jaune"]
[4,"B","VINAY","Guillaume","H",20.5,523598243,20.5,"Jaune"]
[5,"B","NGUYEN","Jean-Paul","H",20.3,536502142,23.1,"Jaune"]
[6,"C","DOGUIN","Pierre","H",24.7,521724243,24.7,"Jaune"]
[7,"D","ROBERT","Valérie","F",25,521904110,25,"Rouge"]
{"$rows_left_out":15}
{"sheet":"Poules","index":3,"n_rows":38,"n_cols":38,"rows_kept":38,"cut":false,"hidden":false,"merged":[[7,0,10,0],[14,0,17,0],[21,0,24,0],[28,0,31,0],[4,29,4,37]]}
["ASIP"]
[null,null,null,null,null,null,null,null,null,null,null,null,null,null,null,{"$f":"CONCATENATE(\"Challenge 35 cuvée \",Cuvée,\" : poules\")","v":"Challenge 35 cuvée 2018 : poules"}]
[]
[]
["Poule","N°","Nom","Index",null,null,9,18,null,"Numéro de rencontre","Rencontre","Poule","Liste_nonvide","Hcp18","Hcp9","Date","Parcours","Trous","Vainqueur","J1","J2","Résultat","Bonus J1","Bonus J2","Bonus J1","Bonus J2",null,null,null,"Classement Poule"]
[null,null,null,null,null,null,null,null,null,null,null,null,null,null,null,null,null,null,null,null,null,null,null,null,"ValNum","ValNum","Score","Bonus",null,null,null,"Match","Bonus","Composé","Rang","Joueur","Matchs","Points"]
[null,null,null,null,null,{"$f":"CONCATENATE(A8,B8,\" / \",A8,B9)","v":"A1 / A8"},{"$f":"C8","v":"MABILE"},{"$f":"C9","v":"M'HAMDI"},"Partagé",{"$f":"IF(COUNTBLANK(K7),0,1)","v":1},{"$f":"IF(OR(G7=\"\",H7=\"\"),\"\",CONCATENATE(G7,\" / \",H7))","v":"MABILE / M'HAMDI"},"A",{"$f":"IF(ROW()-6<28-COUNTBLANK($K$7:$K$33),VLOOKUP(ROW()-6,$J$7:$K$33,2,FALSE),\"\")","v":"MABILE / M'HAMDI"},{"$f":"IF(OR(G7=\"\",H7=\"\"),\"\",MIN(27,ROUND(0.75*(VLOOKUP(H7,Joueurs!$C$4:$F$19,4,FALSE)-VLOOKUP(G7,Joueurs!$C$4:$F$19,4,FALSE)),0)))","v":8},{"$f":"IF(OR(G7=\"\",H7=\"\"),\"\",ROUND(MIN(27,0.75*(VLOOKUP(H7,Joueurs!$C$4:$F$19,4,FALSE)-VLOOKUP(G7,Joueurs!$C$4:$F$19,4,FALSE)))/2,0))","v":4},"2018-06-24","Omaha Beach - Mer",{"$f":"IF(Q7=\"\",\"\",VLOOKUP(Q7,Parcours!$A$2:$B$130,2,FALSE))","v":18},"MABILE",{"$f":"IF(K7=\"\",0,IF(S7=G7,1,IF(S7=\"Partagé\",0.5,0)))","v":1},{"$f":"IF(K7=\"\",0,IF(S7=H7,1,IF(S7=\"Partagé\",0.5,0)))","v":0},"6&5",{"$f":"IF(V7=\"\",0,IF(T7=0,-VLOOKUP(V7,$AA$7:$AB$25,2,FALSE),IF(T7=1,VLOOKUP(V7,$AA$7:$AB$25,2,FALSE),0)))","v":"11"},{"$f":"-W7","v":-11},{"$f":"W7+0.001","v":11.000999999999999},{"$f":"X7+0.001","v":-10.999000000000001},"AS","0"]
["A",1,{"$f":"IF((VLOOKUP(B8,Joueurs!A$4:F$19,3,FALSE))=0,\"\",VLOOKUP(B8,Joueurs!A$4:F$19,3,FALSE))","v":"MABILE"},{"$f":"IF((VLOOKUP(B8,Joueurs!A$4:F$19,3,FALSE))=0,\"\",VLOOKUP(B8,Joueurs!A$4:F$19,6,FALSE))","v":17.399999999999999},null,{"$f":"CONCATENATE(A8,B8,\" / \",A8,B10)","v":"A1 / A9"},{"$f":"C8","v":"MABILE"},{"$f":"C10","v":"BORDET"},"Partagé",{"$f":"J7+IF(COUNTBLANK(K8),0,1)","v":2},"MABILE / BORDET","A",{"$f":"IF(ROW()-6<28-COUNTBLANK($K$7:$K$33),VLOOKUP(ROW()-6,$J$7:$K$33,2,FALSE),\"\")","v":"MABILE / BORDET"},{"$f":"IF(OR(G8=\"\",H8=\"\"),\"\",MIN(27,ROUND(0.75*(VLOOKUP(H8,Joueurs!$C$4:$F$19,4,FALSE)-VLOOKUP(G8,Joueurs!$C$4:$F$19,4,FALSE)),0)))","v":8},{"$f":"IF(OR(G8=\"\",H8=\"\"),\"\",ROUND(MIN(27,0.75*(VLOOKUP(H8,Joueurs!$C$4:$F$19,4,FALSE)-VLOOKUP(G8,Joueurs!$C$4:$F$19,4,FALSE)))/2,0))","v":4},"2018-05-03","Saint Aubin - Le Mesnil",{"$f":"IF(Q8=\"\",\"\",VLOOKUP(Q8,Parcours!$A$2:$B$130,2,FALSE))","v":18},"MABILE",{"$f":"IF(K8=\"\",0,IF(S8=G8,1,IF(S8=\"Partagé\",0.5,0)))","v":1},{"$f":"IF(K8=\"\",0,IF(S8=H8,1,IF(S8=\"Partagé\",0.5,0)))","v":0},"4&2",{"$f":"IF(V8=\"\",0,IF(T8=0,-VLOOKUP(V8,$AA$7:$AB$25,2,FALSE),IF(T8=1,VLOOKUP(V8,$AA$7:$AB$25,2,FALSE),0)))","v":"6"},{"$f":"-W8","v":-6},{"$f":"W8+0.002","v":6.0019999999999998},{"$f":"X8+0.002","v":-5.9980000000000002},"1UP","1",null,"1A",{"$f":"C8","v":"MABILE"},{"$f":"IF(AE8=\"\",-1,SUMIF(G7:G12,AE8,T7:T12)+SUMIF(H7:H12,AE8,U7:U12))","v":3},{"$f":"SUMIF(G7:G12,AE8,Y7:Y12)+SUMIF(H7:H12,AE8,Z7:Z12)","v":20.007000000000001},{"$f":"100*AF8+AG8","v":320.00700000000001},{"$f":"RANK(AH8,AH8:AH11)","v":1},{"$f":"IF(AE8=\"\",\"\",INDEX(AE8:AE11,MATCH(1,AI8:AI11,0)))","v":"MABILE"},{"$f":"IF(AE8=\"\",\"\",VLOOKUP(AJ8,AE8:AF11,2,FALSE))","v":3},{"$f":"IF(AE8=\"\",\"\",VLOOKUP(AJ8,AE8:AG11,3,FALSE))","v":20.007000000000001}]
[null,8,{"$f":"IF((VLOOKUP(B9,Joueurs!A$4:C$19,3,FALSE))=0,\"\",VLOOKUP(B9,Joueurs!A$4:C$19,3,FALSE))","v":"M'HAMDI"},{"$f":"IF((VLOOKUP(B9,Joueurs!A$4:F$19,3,FALSE))=0,\"\",VLOOKUP(B9,Joueurs!A$4:F$19,6,FALSE))","v":27.5},null,{"$f":"CONCATENATE(A8,B9,\" / \",A8,B10)","v":"A8 / A9"},{"$f":"C9","v":"M'HAMDI"},{"$f":"C10","v":"BORDET"},"Partagé",3,"M'HAMDI / BORDET","A",{"$f":"IF(ROW()-6<28-COUNTBLANK($K$7:$K$33),VLOOKUP(ROW()-6,$J$7:$K$33,2,FALSE),\"\")","v":"M'HAMDI / BORDET"},{"$f":"IF(OR(G9=\"\",H9=\"\"),\"\",MIN(27,ROUND(0.75*(VLOOKUP(H9,Joueurs!$C$4:$F$19,4,FALSE)-VLOOKUP(G9,Joueurs!$C$4:$F$19,4,FALSE)),0)))","v":1},{"$f":"IF(OR(G9=\"\",H9=\"\"),\"\",ROUND(MIN(27,0.75*(VLOOKUP(H9,Joueurs!$C$4:$F$19,4,FALSE)-VLOOKUP(G9,Joueurs!$C$4:$F$19,4,FALSE)))/2,0))","v":0},"2018-05-26","Forges les Bains",{"$f":"IF(Q9=\"\",\"\",VLOOKUP(Q9,Parcours!$A$2:$B$130,2,FALSE))","v":18},"BORDET",0,1,"6&5",-11,11,{"$f":"W9+0.003","v":-10.997},{"$f":"X9+0.003","v":11.003},"2UP","2",null,"2A",{"$f":"C9","v":"M'HAMDI"},{"$f":"IF(AE9=\"\",-1,SUMIF(G7:G12,AE9,T7:T12)+SUMIF(H7:H12,AE9,U7:U12))","v":0},{"$f":"SUMIF(G7:G12,AE9,Y7:Y12)+SUMIF(H7:H12,AE9,Z7:Z12)","v":-24.991},{"$f":"100*AF9+AG9","v":-24.991},{"$f":"RANK(AH9,AH8:AH11)","v":4},{"$f":"IF(AE9=\"\",\"\",INDEX(AE8:AE11,MATCH(2,AI8:AI11,0)))","v":"BORDET"},{"$f":"IF(AE9=\"\",\"\",VLOOKUP(AJ9,AE8:AF11,2,FALSE))","v":2},{"$f":"IF(AE9=\"\",\"\",VLOOKUP(AJ9,AE8:AG11,3,FALSE))","v":8.0109999999999992}]
[null,9,{"$f":"IF((VLOOKUP(B10,Joueurs!A$4:C$19,3,FALSE))=0,\"\",VLOOKUP(B10,Joueurs!A$4:C$19,3,FALSE))","v":"BORDET"},{"$f":"IF((VLOOKUP(B10,Joueurs!A$4:F$19,3,FALSE))=0,\"\",VLOOKUP(B10,Joueurs!A$4:F$19,6,FALSE))","v":28.4},null,{"$f":"CONCATENATE(A8,B8,\" / \",A8,B11)","v":"A1 / A16"},{"$f":"C8","v":"MABILE"},{"$f":"C11","v":"PICARD"},"Partagé",4,"MABILE / PICARD","A","MABILE / PICARD",{"$f":"IF(OR(G10=\"\",H10=\"\"),\"\",MIN(27,ROUND(0.75*(VLOOKUP(H10,Joueurs!$C$4:$F$19,4,FALSE)-VLOOKUP(G10,Joueurs!$C$4:$F$19,4,FALSE)),0)))","v":21},{"$f":"IF(OR(G10=\"\",H10=\"\"),\"\",ROUND(MIN(27,0.75*(VLOOKUP(H10,Joueurs!$C$4:$F$19,4,FALSE)-VLOOKUP(G10,Joueurs!$C$4:$F$19,4,FALSE)))/2,0))","v":11},"2018-06-23","Caen - Plaine Vallon",{"$f":"IF(Q10=\"\",\"\",VLOOKUP(Q10,Parcours!$A$2:$B$130,2,FALSE))","v":18},"MABILE",{"$f":"IF(K10=\"\",0,IF(S10=G10,1,IF(S10=\"Partagé\",0.5,0)))","v":1},{"$f":"IF(K10=\"\",0,IF(S10=H10,1,IF(S10=\"Partagé\",0.5,0)))","v":0},"2&1","3",-3,{"$f":"W10+0.004","v":3.004},{"$f":"X10+0.004","v":-2.996},"2&1","3",null,"3A",{"$f":"C10","v":"BORDET"},{"$f":"IF(AE10=\"\",-1,SUMIF(G7:G12,AE10,T7:T12)+SUMIF(H7:H12,AE10,U7:U12))","v":2},{"$f":"SUMIF(G7:G12,AE10,Y7:Y12)+SUMIF(H7:H12,AE10,Z7:Z12)","v":8.0109999999999992},208.011,{"$f":"RANK(AH10,AH8:AH11)","v":2},{"$f":"IF(AE10=\"\",\"\",INDEX(AE8:AE11,MATCH(3,AI8:AI11,0)))","v":"PICARD"},{"$f":"IF(AE10=\"\",\"\",VLOOKUP(AJ10,AE8:AF11,2,FALSE))","v":1},{"$f":"IF(AE10=\"\",\"\",VLOOKUP(AJ10,AE8:AG11,3,FALSE))","v":-2.9850000000000003}]
{"$rows_left_out":29}
{"sheet":"Tournoi","index":4,"n_rows":63,"n_cols":50,"rows_kept":63,"cut":false,"hidden":false,"merged":[[7,4,8,4],[7,5,8,5],[13,4,14,4],[13,5,14,5],[19,4,20,4],[19,5,20,5],[16,10,17,10],[16,11,17,11],[25,4,26,4],[25,5,26,5],[10,7,11,7],[10,8,11,8],[22,7,23,7],[22,8,23,8]]}
[]
[null,null,null,null,null,null,{"$f":"CONCATENATE(\"Challenge 35 cuvée \",Cuvée,\" : tableau final\")","v":"Challenge 35 cuvée 2018 : tableau final"}]
[]
[]
[null,null,"1/4 finale (avant 8 oct.)"]
[null,null,null,null,"1/2 finale (avant 29 oct.)"]
[null,"1A",{"$f":"IF(OR(Poules!AK8>=Poules!$AJ$12-1,Poules!$AK$12=Poules!$AL$12),Poules!AJ8,\"\")","v":"MABILE"},null,{"$f":"IF(OR(C7=\"\",C10=\"\"),\"\",CONCATENATE(C7,\" / \",C10))","v":"MABILE / LEFRANC"}]
[null,null,{"$f":"C7","v":"MABILE"},"Saint Marc","MABILE","8&6"]
[null,null,{"$f":"C10","v":"LEFRANC"},"2018-09-26",null,null,null,"Finale (10 nov.)"]
[null,"2C",{"$f":"IF(OR(Poules!AK23>=Poules!$AJ$26-1,Poules!$AK$26=Poules!$AL$26),Poules!AJ23,\"\")","v":"LEFRANC"},null,null,null,null,{"$f":"IF(OR(E8=\"\",E14=\"\"),\"\",CONCATENATE(E8,\" / \",E14))","v":"MABILE / ROME"}]
{"$rows_left_out":54}
{"sheet":"Feuille de match","index":5,"n_rows":33,"n_cols":26,"rows_kept":33,"cut":false,"hidden":false,"merged":[[1,13,1,17],[4,5,4,11],[4,18,4,23],[7,11,9,11]]}
["ASIP",null,null,null,null,null,null,null,null,null,null,null,null,null,null,null,null,null,null,null,null,null,null,null,null,"Scores"]
[null,null,null,null,null,null,null,null,null,null,null,null,"Challenge 35  -  Rencontre : ","MABILE / VINAY",null,null,null,null,null,null,null,null,null,null,null,"x"]
[null,null,null,null,null,null,null,null,null,null,null,null,{"$f":"IF(OR(C7=\"\",C9=\"\"),\"\",CONCATENATE(C7,\" / \",C9))","v":""},null,{"$f":"VLOOKUP(LEFT(Rencontre_Tournoi,SEARCH(\"/\",Rencontre_Tournoi)-2),Joueurs!C$4:F$19,4,FALSE)","v":17.399999999999999},null,{"$f":"VLOOKUP(RIGHT(Rencontre_Tournoi,LEN(Rencontre_Tournoi)-SEARCH(\"/\",Rencontre_Tournoi)-1),Joueurs!C$4:F$19,4,FALSE)","v":20.5},null,null,null,null,null,null,null,null,"-"]
[null,null,null,null,null,null,null,null,null,null,null,null,null,null,null,null,null,null,null,null,null,null,null,null,null,1]
[null,null,null,null,"Parcours : ",{"$f":"IF(Rencontre_Tournoi=\"\",\"\",IF(VLOOKUP(Rencontre_Tournoi,Tournoi!$D$32:$G$63,4,FALSE)=\"\",\"\",VLOOKUP(Rencontre_Tournoi,Tournoi!$D$32:$G$63,4,FALSE)))","v":"Fourqueux - Blanc Rouge"},null,null,null,null,null,null,null,"Trous :",{"$f":"IF(Rencontre_Tournoi=\"\",\"\",IF(Parcours=\"\",\"\",VLOOKUP(Parcours,Parcours!$A$2:$B$130,2,FALSE)))","v":18},null,null,"Date : ",{"$f":"IF(Rencontre_Tournoi=\"\",\"\",IF(VLOOKUP(Rencontre_Tournoi,Tournoi!$D$32:$F$63,3,FALSE)=\"\",\"\",VLOOKUP(Rencontre_Tournoi,Tournoi!$D$32:$F$63,3,FALSE)))","v":"2018-11-10"},null,null,null,null,null,null,2]
[null,null,null,null,null,null,null,null,null,null,null,null,null,null,null,null,null,null,null,null,null,null,null,null,null,3]
[null,null,null,null,null,null,null,null,null,null,null,null,null,null,null,null,null,null,null,null,null,null,null,null,null,4]
[null,null,{"$f":"IF(O3<Q3,LEFT(Rencontre_Tournoi,SEARCH(\"/\",Rencontre_Tournoi)-2),RIGHT(Rencontre_Tournoi,LEN(Rencontre_Tournoi)-SEARCH(\"/\",Rencontre_Tournoi)-1))","v":"MABILE"},{"$f":"IF((VLOOKUP(C8,Joueurs!C$4:F$19,1,FALSE))=0,\"\",CONCATENATE(VLOOKUP(C8,Joueurs!C$4:F$19,2,FALSE),\" \",VLOOKUP(C8,Joueurs!C$4:F$19,1,FALSE)))","v":"Claude MABILE"},null,null,null,null,"Index :",{"$f":"IF(VLOOKUP(Rencontre_Tournoi,Tournoi!$D$32:$M$63,9,FALSE)=\"\",IF((VLOOKUP(C8,Joueurs!C$4:F$19,1,FALSE))=0,\"\",VLOOKUP(C8,Joueurs!C$4:F$19,4,FALSE)),VLOOKUP(Rencontre_Tournoi,Tournoi!$D$32:$M$63,9,FALSE))","v":17.399999999999999},null,null,null,null,null,null,null,null,null,null,null,null,null,null,null,5]
[{"$f":"IF(Rencontre_Tournoi=\"\",\"\",IF(VLOOKUP(Rencontre_Tournoi,Tournoi!$D$32:$G$63,2,FALSE)=\"\",\"\",VLOOKUP(Rencontre_Tournoi,Tournoi!$D$32:$G$63,2,FALSE)))","v":"Finale"},null,null,null,null,null,null,null,null,null,null,null,null,null,null,null,null,{"$f":"CONCATENATE(\"Coups reçus par \",$C$10,\" :\")","v":"Coups reçus par VINAY :"},{"$f":"IF(OR(Trous=\"\",J8=\"\",J10=\"\"),\"\",ROUND(MIN(27,T9*(J10-J8))/(18/Trous),0))","v":2},0.75,null,null,null,null,null,6]
[null,null,{"$f":"IF(O3>=Q3,LEFT(Rencontre_Tournoi,SEARCH(\"/\",Rencontre_Tournoi)-2),RIGHT(Rencontre_Tournoi,LEN(Rencontre_Tournoi)-SEARCH(\"/\",Rencontre_Tournoi)-1))","v":"VINAY"},{"$f":"IF((VLOOKUP(C10,Joueurs!C$4:F$19,1,FALSE))=0,\"\",CONCATENATE(VLOOKUP(C10,Joueurs!C$4:F$19,2,FALSE),\" \",VLOOKUP(C10,Joueurs!C$4:F$19,1,FALSE)))","v":"Guillaume VINAY"},null,null,null,null,"Index :",{"$f":"IF(VLOOKUP(Rencontre_Tournoi,Tournoi!$D$32:$M$63,10,FALSE)=\"\",IF((VLOOKUP(C10,Joueurs!C$4:F$19,1,FALSE))=0,\"\",VLOOKUP(C10,Joueurs!C$4:F$19,4,FALSE)),VLOOKUP(Rencontre_Tournoi,Tournoi!$D$32:$M$63,10,FALSE))","v":20.5},null,null,null,null,null,null,null,null,null,null,null,null,null,null,null,7]
{"$rows_left_out":24}
{"sheet":"Joueur 1","index":6,"n_rows":30,"n_cols":26,"rows_kept":30,"cut":false,"hidden":true,"merged":[[4,5,4,11],[4,18,4,23],[28,1,30,23]]}
["ASIP",null,null,null,null,null,null,null,null,null,null,null,null,null,null,null,null,null,null,null,null,null,null,null,null,"Scores"]
[null,null,null,null,null,null,null,null,null,null,"Joueur 1 :",null,{"$f":"'Feuille de match'!D8","v":"Claude MABILE"},null,null,null,null,null,null,null,null,null,null,null,null,"x"]
[null,null,null,null,null,null,null,null,null,null,null,null,null,null,null,null,null,null,null,null,null,null,null,null,null,1]
[null,null,null,null,null,null,null,null,null,null,null,null,null,null,null,null,null,null,null,null,null,null,null,null,null,2]
[null,null,null,null,"Parcours : ",{"$f":"'Feuille de match'!Parcours","v":"Fourqueux - Blanc Rouge"},null,null,null,null,null,null,null,"Trous :",{"$f":"'Feuille de match'!Trous","v":18},null,null,"Date : ",{"$f":"'Feuille de match'!S5:X5","v":"2018-11-10"},null,null,null,null,null,null,3]
[null,null,null,null,null,null,null,null,null,null,null,null,null,null,null,null,null,null,null,null,null,null,null,null,null,4]
[null,null,null,null,null,null,null,null,null,null,null,null,null,null,null,null,null,null,null,null,null,null,null,null,null,5]
["Index :",{"$f":"IF(VLOOKUP([0]!Rencontre_Tournoi,Tournoi!$D$32:$M$63,9,FALSE)=\"\",IF((VLOOKUP('Feuille de match'!Joueur1,Joueurs!C$4:F$19,1,FALSE))=0,\"\",VLOOKUP('Feuille de match'!Joueur1,Joueurs!C$4:F$19,4,FALSE)),VLOOKUP([0]!Rencontre_Tournoi,Tournoi!$D$32:$M$63,9,FALSE))","v":17.399999999999999},null,null,"Repère :",{"$f":"IF((VLOOKUP('Feuille de match'!Joueur1,Joueurs!C$4:C$19,1,FALSE))=0,\"\",VLOOKUP('Feuille de match'!Joueur1,Joueurs!C$4:I$19,7,FALSE))","v":"Jaune"},null,null,"Slope :",{"$f":"VLOOKUP(Parcours,Parcours!$A$2:$AV$130,MATCH(CONCATENATE(\"Slope \",F8),Parcours!A1:AV1,0),FALSE)","v":131},null,"SSS :",{"$f":"VLOOKUP(Parcours,Parcours!$A$2:$AV$130,MATCH(CONCATENATE(\"SSS \",F8),Parcours!A1:AV1,0),FALSE)","v":69.900000000000006},null,null,null,null,"Coups reçus :",{"$f":"MIN(TRUNC(B8*J8/113+M8-X12+0.5),54)","v":19},null,null,null,null,null,null,8]
[null,null,null,null,null,null,null,null,null,null,null,null,null,null,null,null,null,null,null,null,null,null,null,null,null,9]
[null,null,null,null,null,null,null,null,null,null,null,null,null,null,null,null,null,null,null,null,null,null,null,null,null,10]
{"$rows_left_out":21}
{"sheet":"Joueur 2","index":7,"n_rows":30,"n_cols":26,"rows_kept":30,"cut":false,"hidden":true,"merged":[[4,5,4,11],[4,18,4,23],[28,1,30,23]]}
["ASIP",null,null,null,null,null,null,null,null,null,null,null,null,null,null,null,null,null,null,null,null,null,null,null,null,"Scores"]
[null,null,null,null,null,null,null,null,null,null,"Joueur 2 :",null,{"$f":"'Feuille de match'!D10","v":"Guillaume VINAY"},null,null,null,null,null,null,null,null,null,null,null,null,"x"]
[null,null,null,null,null,null,null,null,null,null,null,null,null,null,null,null,null,null,null,null,null,null,null,null,null,1]
[null,null,null,null,null,null,null,null,null,null,null,null,null,null,null,null,null,null,null,null,null,null,null,null,null,2]
[null,null,null,null,"Parcours : ",{"$f":"'Feuille de match'!Parcours","v":"Fourqueux - Blanc Rouge"},null,null,null,null,null,null,null,"Trous :",{"$f":"'Feuille de match'!Trous","v":18},null,null,"Date : ",{"$f":"'Feuille de match'!S5:X5","v":"2018-11-10"},null,null,null,null,null,null,3]
[null,null,null,null,null,null,null,null,null,null,null,null,null,null,null,null,null,null,null,null,null,null,null,null,null,4]
[null,null,null,null,null,null,null,null,null,null,null,null,null,null,null,null,null,null,null,null,null,null,null,null,null,5]
["Index :",{"$f":"IF(VLOOKUP([0]!Rencontre_Tournoi,Tournoi!$D$32:$M$63,10,FALSE)=\"\",IF((VLOOKUP('Feuille de match'!Joueur2,Joueurs!C$4:F$19,1,FALSE))=0,\"\",VLOOKUP('Feuille de match'!Joueur2,Joueurs!C$4:F$19,4,FALSE)),VLOOKUP([0]!Rencontre_Tournoi,Tournoi!$D$32:$M$63,10,FALSE))","v":20.5},null,null,"Repère :",{"$f":"IF((VLOOKUP('Feuille de match'!Joueur2,Joueurs!C$4:C$19,1,FALSE))=0,\"\",VLOOKUP('Feuille de match'!Joueur2,Joueurs!C$4:I$19,7,FALSE))","v":"Jaune"},null,null,"Slope :",{"$f":"VLOOKUP(Parcours,Parcours!$A$2:$AV$130,MATCH(CONCATENATE(\"Slope \",F8),Parcours!A1:AV1,0),FALSE)","v":131},null,"SSS :",{"$f":"VLOOKUP(Parcours,Parcours!$A$2:$AV$130,MATCH(CONCATENATE(\"SSS \",F8),Parcours!A1:AV1,0),FALSE)","v":69.900000000000006},null,null,null,null,"Coups reçus :",{"$f":"MIN(TRUNC(B8*J8/113+M8-X12+0.5),54)","v":23},null,null,null,null,null,null,8]
[null,null,null,null,null,null,null,null,null,null,null,null,null,null,null,null,null,null,null,null,null,null,null,null,null,9]
[null,null,null,null,null,null,null,null,null,null,null,null,null,null,null,null,null,null,null,null,null,null,null,null,null,10]
{"$rows_left_out":21}
{"sheet":"Indiv","index":8,"n_rows":30,"n_cols":26,"rows_kept":30,"cut":false,"hidden":true,"merged":[[4,5,4,11],[4,18,4,23],[28,1,30,23],[1,12,1,18]]}
["ASIP",null,null,null,null,null,null,null,null,null,null,null,null,null,null,null,null,null,null,null,null,null,null,null,null,"Scores"]
[null,null,null,null,null,null,null,null,null,null,"Joueur :",null,"Alex NOREN",null,null,null,null,null,null,null,null,null,null,null,null,"x"]
[null,null,null,null,null,null,null,null,null,null,null,null,null,null,null,null,null,null,null,null,null,null,null,null,null,1]
[null,null,null,null,null,null,null,null,null,null,null,null,null,null,null,null,null,null,null,null,null,null,null,null,null,2]
[null,null,null,null,"Parcours : ","National - Albatros",null,null,null,null,null,null,null,"Trous :",{"$f":"IF(F5=\"\",\"\",VLOOKUP(F5,Parcours!$A$2:$B$130,2,FALSE))","v":18},null,null,"Date : ","2018-07-01",null,null,null,null,null,null,3]
[null,null,null,null,null,null,null,null,null,null,null,null,null,null,null,null,null,null,null,null,null,null,null,null,null,4]
[null,null,null,null,null,null,null,null,null,null,null,null,null,null,null,null,null,null,null,null,null,null,null,null,null,5]
["Index :",0,null,null,"Repère :","Blanc",null,null,"Slope :",{"$f":"VLOOKUP(Parcours,Parcours!$A$2:$AV$130,MATCH(CONCATENATE(\"Slope \",F8),Parcours!A1:AV1,0),FALSE)","v":155},null,"SSS :",{"$f":"VLOOKUP(Parcours,Parcours!$A$2:$AV$130,MATCH(CONCATENATE(\"SSS \",F8),Parcours!A1:AV1,0),FALSE)","v":73.8},null,null,null,null,"Coups reçus :",{"$f":"MIN(TRUNC(B8*J8/113+M8-X12+0.5),54)","v":2},null,null,null,null,null,null,8]
[null,null,null,null,null,null,null,null,null,null,null,null,null,null,null,null,null,null,null,null,null,null,null,null,null,9]
[null,null,null,null,null,null,null,null,null,null,null,null,null,null,null,null,null,null,null,null,null,null,null,null,null,10]
{"$rows_left_out":20}